ENVIRONMENTAL GOVERNANCE/MANAGEMENT
type: Concept

CARBON CAPTURE AND STORAGE
change note: 2019-03-13 07:55:44.0 [tstevens] Insert Concept add broader relation (CARBON CAPTURE AND STORAGE [e8c24822-7d2d-48c6-9dca-df3860e9bd63,368575] - ENVIRONMENTAL GOVERNANCE/MANAGEMENT [d81b77be-0177-4e26-942c-aa911239482d,87343]);
alternative label: CCS
in scheme: sciencekeywords
definition: Carbon dioxide capture and storage (CCS) is a process consisting of the separation of carbon dioxide from industrial and energy-related sources, transport to a storage location, and long-term isolation from the atmosphere.
type: Concept