TMRS2
change note: 2021-11-18 08:26:50.0 [tstevens] Move Concepts delete broader relation (null); add broader relation (TMRS2 [e9046495-96f1-4f28-9ca0-9f35b10c7c14,826860] - Permanent Land Sites [0ec10fd9-492c-498a-b6d8-e2840cc3643b,835887]);
change note: 2022-02-11 09:28:52.0 [tstevens] update Definition (The Tower Mounted Radiometer System (TMRS2) was a ground-based SSM/I simulator and surface energy balance monitoring system. The primary application of TMRS2 were to collect long-term (months) time-series data sets at sites representative of various biomes in support of land surface process modeling and remote sensing research. The system was also used in support of studies in the passive remote sensing of soil moisture, frozen/thawed soil state determination, permafrost, and snow.); update Definition (University of Michigan, College of Engineering); update Resource (image);
type: Concept
definition: The Tower Mounted Radiometer System (TMRS2) was a ground-based SSM/I simulator and surface energy balance monitoring system. The primary application of TMRS2 were to collect long-term (months) time-series data sets at sites representative of various biomes in support of land surface process modeling and remote sensing research. The system was also used in support of studies in the passive remote sensing of soil moisture, frozen/thawed soil state determination, permafrost, and snow.
in scheme: platforms

Permanent Land Sites
type: Concept