Jet
type: Concept

G-II
change note: 2022-02-17 08:58:33.0 [tstevens] update Definition (The Rolls-Royce Dart turboprop powered Grumman Gulfstream I proved to be quite successful as a large long range corporate transport, while the availability of an faster and more powerful turbojet powered model, the Rolls-Royce Spey meant that a jet powered successor was a logical development. Grumman launched such an aircraft, named the Gulfstream II or G-II, in May 1965.); delete Resource (null);
change note: 2021-11-16 15:16:44.0 [tstevens] Move Concepts delete broader relation (null); add broader relation (G-II [e9b3e773-5a35-4793-9683-737a9dc82524,826865] - Jet [5b8e4067-db4e-42d4-b4a5-7de5e683125d,835881]);
change note: 2021-11-16 15:16:34.0 [tstevens] Cut Concepts delete broader relation (null); add broader relation (G-II [e9b3e773-5a35-4793-9683-737a9dc82524,826865] - Trash Can/Platforms [6089b3e5-7db9-46e1-b73b-2d679f34abb4,831469]);
change note: 2014-07-02 11:10:13.0 [aaleman] fixed typo update PrefLabel (G-II);
change note: 2014-07-02 11:08:50.0 [aaleman] edited keyword at NSIDC request insert AltLabel (id: null text: GULFSTREAM II language code: en); update PrefLabel (G-2);
type: Concept
in scheme: platforms
definition: The Rolls-Royce Dart turboprop powered Grumman Gulfstream I proved to be quite successful as a large long range corporate transport, while the availability of an faster and more powerful turbojet powered model, the Rolls-Royce Spey meant that a jet powered successor was a logical development. Grumman launched such an aircraft, named the Gulfstream II or G-II, in May 1965.