SEDIMENTATION
type: Concept

STRATIGRAPHIC SEQUENCE
change note: 2013-08-20 12:43:46.0 [tbs1979] insert Definition (id: null text: A chronological succession of sedimentary rocks. language code: en);
change note: 2013-08-05 12:43:12.0 [tbs1979] Insert Concept add broader relation (STRATIGRAPHIC SEQUENCE [e9c6d45a-787e-4099-bbf9-03d377cdb8d5,105359] - SEDIMENTATION [b1de8d2f-cfe6-4358-a4cd-5b7e19d0e585,105353]);
in scheme: sciencekeywords
definition: A chronological succession of sedimentary rocks.
type: Concept