FRANCE
type: Concept

FR/CNRS/UPMC/LOV
in scheme: providers
definition: The Oceanography Laboratory of Villefranche (LOV) fosters collaborations amongst marine scientists at the national, European and international level and invites visiting researchers to use state-of-the-art equipment in our laboratories.
type: Concept