PACK ICE
in scheme: sciencekeywords
definition: Pack ice refers to high concentrations of sea ice. When concentrations are 60% or less, then the term drift ice is used.
type: Concept

SEA ICE
type: Concept