NERITIC ZONE
change note: 2016-06-14 11:40:17.0 [gee-cee] insert Definition (id: null text: Pertaining to open water above the continental shelves. language code: en);
change note: 2016-06-14 11:39:18.0 [gee-cee] Insert Concept add broader relation (NERITIC ZONE [eb958dfb-5e38-401f-8b42-5f1273c75a4a,188237] - PELAGIC HABITAT [3d7ecc4f-e79e-40d1-8796-63059888bf5f,84265]);
in scheme: sciencekeywords
definition: Pertaining to open water above the continental shelves.
type: Concept

PELAGIC
type: Concept