S-MODE
change note: 2022-04-29 08:12:46.0 [tstevens] insert AltLabel (id: null category: primary text: Sub-Mesoscale Ocean Dynamics Experiment language code: en); insert Definition (id: null text: The Sub-Mesoscale Ocean Dynamics Experiment (S-MODE) is a 5-year effort to test the hypothesis that short spatial scale ocean dynamics make important contributions to the vertical exchange of physical and biological variables in the ocean. This will require coordinated application of newly-developed in situ and remote sensing techniques, and it will provide an unprecedented view of the physics of submesoscale eddies and fronts and their effects on vertical transport in the upper ocean. The Sub-Mesoscale Ocean Dynamics Experiment (S-MODE) will use measurements from a novel combination of platforms and instruments, along with data analysis and modeling, to test the hypothesis. language code: en);
change note: 2022-04-29 08:08:21.0 [tstevens] Insert Concept add broader relation (S-MODE [eb9c7c89-e580-4d44-ae77-c99794b5253a,908987] - S - U [4eb1894b-35b4-406b-8864-944a42bc7702,902418]);
in scheme: projects
definition: The Sub-Mesoscale Ocean Dynamics Experiment (S-MODE) is a 5-year effort to test the hypothesis that short spatial scale ocean dynamics make important contributions to the vertical exchange of physical and biological variables in the ocean. This will require coordinated application of newly-developed in situ and remote sensing techniques, and it will provide an unprecedented view of the physics of submesoscale eddies and fronts and their effects on vertical transport in the upper ocean. The Sub-Mesoscale Ocean Dynamics Experiment (S-MODE) will use measurements from a novel combination of platforms and instruments, along with data analysis and modeling, to test the hypothesis.
type: Concept

S - U
type: Concept