DOI/USGS/GD/CR/GHT
in scheme: providers
definition: The Geologic Hazards Team is located in Golden, Colorado, on the Colorado School of Mines campus. The Team works in the following three areas: * Earthquake Hazards Program * Landslide Hazards Program * Geomagnetism Program Information provided by http://geohazards.cr.usgs.gov/
type: Concept

USGS
type: Concept