CESSNA 206
change note: 2021-11-17 11:52:46.0 [tstevens] Move Concepts delete broader relation (null); add broader relation (CESSNA 206 [ebf5d441-db97-4691-a8fc-08b4afdbac46,826876] - Propeller [6175c78e-432c-4254-b442-40d3cf0f6b34,835882]);
in scheme: platforms
definition: The Cessna 205, 206, and 207, known variously as the Super Skywagon, Stationair, and Super Skylane are a family of single engine, general aviation aircraft with fixed landing gear used in commercial air service and also for personal use. The family was originally developed from the popular retractable-gear Cessna 210. The line's combination of a powerful engine, rugged construction and a large cabin has made these aircraft popular bush planes. Cessna describes the 206 as "the sport-utility vehicle of the air." These airplanes are also used for aerial photography, skydiving and other utility purposes. They can also be equipped with floats, amphibious floats and skis. Alternatively, they can be fitted with luxury appointments for use as a personal air transport. Between the start of production in 1962 and 2006 the total Cessna 205, 206 and 207 production has been 8509 aircraft so far. [Text and Photo provided by: http://en.wikipedia.org/wiki/Cessna_206 ] Group: Platform_Details Entry_ID: CESSNA 206 Group: Platform_Identification Platform_Category: Aircraft Short_Name: CESSNA 206 End_Group Creation_Date: 2008-07-14 Online_Resource: http://en.wikipedia.org/wiki/Cessna_206 Online_Resource: http://www.cessna.com/ Sample_Image: http://upload.wikimedia.org/wikipedia/commons/thumb/9/91/Cessna.206h.stationair2.arp.jpg/800px-Cessna.206h.stationair2.arp.jpg End_Group
type: Concept

Propeller
type: Concept