HDM
in scheme: providers
definition: HDM designs and develops advanced technology solutions for government and industry, including: Geospatial information systems (GIS) WebGIS mapping components International geocoding web services Quality Control / Quality Assurance web integration Transportation systems engineering Homeland and industrial security systems Wireless and web based applications Since 1988, HDM has provided high quality services and 'best in class' applications for our clients. Large U.S. government agencies, FORTUNE 1000 companies and large regional utilities all trust HDM to deliver systems on time and on budget. It is HDM's extensive knowledge and expertise in the mapping sciences, especially with the latest technology available in the industry, that has helped us plan for and build successful GIS systems for our clients. From single user and workgroup systems to enterprise-wide solutions and web / Internet applications, HDM provides expert GIS services in data management and custom applications solutions. Website: http://www.hdm.com/
type: Concept

COMMERCIAL
type: Concept