SCATTERING
in scheme: sciencekeywords
definition: The process in which a wave or beam of particles is diffused or deflected by collisions with particles of the medium which it traverses. Along with absorption, scattering is a major cause of the attenuation of radiation by the atmosphere.
type: Concept

ATMOSPHERIC RADIATION
type: Concept