POLDER-1
change note: 2014-02-26 12:34:51.0 [mpmorahan] Remove Concepts delete narrower relation (null);
change note: 2014-02-26 12:33:27.0 [mpmorahan] Insert Concept add narrower relation (POLDER-1 [ecfc7717-1c5f-48ba-bc42-f37daaace47c,76095] - POLDER-2 [458148e8-2e83-4855-90ce-d9e944e58ab6,106173]);
change note: 2014-02-26 12:37:57.0 [mpmorahan] update AltLabel (Polarization/Directionality of the Earth's Reflectance-1);
change note: 2014-02-26 12:32:51.0 [mpmorahan] Rename Concept update PrefLabel (POLDER-1);
definition: The POLDER instrument is a camera composed of a two-dimensional CCD detector array, wide field of view telecentric optics and a rotating wheel carrying spectral and polarized filters.[https://polder-mission.cnes.fr/en/POLDER/GP_instrument.htm] Group: Instrument_Details Entry_ID: POLDER-1 Group: Instrument_Identification Instrument_Category: Earth Remote Sensing Instruments Instrument_Class: Passive Remote Sensing Instrument_Type: Spectrometers/Radiometers Instrument_Subtype: Imaging Spectrometers/Radiometers Short_Name: POLDER-1 Long_Name: Polarization/Directionality of the Earth's Reflectance-1 End_Group Group: Associated_Platforms Short_Name: PARASOL Short_Name: ADEOS-I End_Group Group: Spectral_Frequency_Information Wavelength_Keyword: Near Infrared End_Group Group: Spectral_Frequency_Information Wavelength_Keyword: Visible End_Group Online_Resource: https://polder-mission.cnes.fr/en/POLDER/GP_instrument.htm Sample_Image: http://smsc.cnes.fr/IcPOLDER/P27110p.gif Creation_Date: 2007-05-22 Group: Instrument_Logistics Data_Rate: 882 kbps Instrument_Owner: CNES End_Group End_Group
type: Concept
in scheme: instruments

Imaging Spectrometers/Radiometers
type: Concept