CHLOROPHYLL
type: Concept

OCEAN CHEMISTRY
type: Concept

PIGMENTS
in scheme: sciencekeywords
definition: Colored organic compounds synthesized by organisms. Names of specific pigments are included as detailed variables under Pigments.
type: Concept