DOD
type: Concept

DOD/USNAVY/NRL/RSD
in scheme: providers
definition: The Remote Sensing Division conducts a program of basic research, science, and applications aimed at the development of new concepts for sensors and imaging systems for objects and targets on the Earth, in the near-Earth environment, and in deep space. More Information: http://www.nrl.navy.mil/rsd/
type: Concept