Chemical Meters/Analyzers
type: Concept

AIR PERMEAMETERS
in scheme: instruments
definition: Air permeameters measure the permeability of air through a solid substance such as snow, ice, soils, or rock.
type: Concept