EROSION
change note: 2012-07-05 15:32:21.0 [mpmorahan] insert Definition (id: null text: The process by which soil, rock or sand is gradually worn away by water or wind action. language code: en);
change note: 2012-06-26 10:38:12.0 [gee-cee] Insert Concept add broader relation (EROSION [eec5b471-bcc5-4d9b-8274-f3990e79ed84,39817] - SEA LEVEL RISE [536a86bd-3dd1-4f4a-9b4a-222a12746db5,39813]);
in scheme: sciencekeywords
definition: The process by which soil, rock or sand is gradually worn away by water or wind action.
type: Concept

SEA LEVEL RISE
type: Concept