Radiant Earth Foundation
change note: 2022-01-05 08:36:22.0 [tstevens] Insert Concept add broader relation (Radiant Earth Foundation [eecf4b61-8315-4bed-8dda-f03f873ef827,836009] - CONSORTIA/INSTITUTIONS [aef2fc80-def0-46a4-9259-9dc37e80ed08,822200]);
in scheme: providers
definition: Radiant Earth Foundation is a non-profit organization actively working to develop Earth observation machine learning libraries and models through an open source hub that support global missions like agriculture, conservation, and climate change. Radiant Earth also fosters a community of practice to develop standards around machine learning for Earth observation and provide information on the progress and innovation in the Earth observation marketplace.
type: Concept

CONSORTIA/INSTITUTIONS
type: Concept