WIND SHEAR
type: Concept

HORIZONTAL WIND SHEAR
change note: 2017-04-21 12:45:17.0 [tstevens] Move Concepts delete broader relation (null); add broader relation (HORIZONTAL WIND SHEAR [ef91f2b6-27e9-42ab-b8c6-4410aace0141,278933] - WIND SHEAR [05cf5b56-0f86-4819-b713-1272b97b06c5,83365]);
change note: 2017-04-21 12:43:04.0 [tstevens] insert Definition (id: null text: A horizontal variation in current speed within a flow. language code: en);
change note: 2017-04-21 12:40:10.0 [tstevens] Insert Concept add broader relation (HORIZONTAL WIND SHEAR [ef91f2b6-27e9-42ab-b8c6-4410aace0141,278933] - VORTICITY [858a80ff-5aa4-4590-b2e2-e88a802a6ee4,83361]);
in scheme: sciencekeywords
definition: A horizontal variation in current speed within a flow.
type: Concept