GNETOPS
change note: 2017-03-15 11:14:53.0 [mgenazzi] Definition added insert Definition (id: null text: Gnetophytes are a small group of Gymnosperms characterized by the presence of vessels elements. language code: en);
in scheme: sciencekeywords
definition: Gnetophytes are a small group of Gymnosperms characterized by the presence of vessels elements.
type: Concept

GYMNOSPERMS
type: Concept