STANFORD-U/CS/VIS
in scheme: providers
definition: The Human-Computer Interaction & Visualization Group at Stanford University investigates the perceptual, cognitive, and social factors involved in making sense of large data collections, and develop novel interactive systems for visual analysis and communication. [Summary provided by Stanford University.]
type: Concept

ACADEMIC
type: Concept