A - C
type: Concept

ALOS Science Project
change note: 2014-01-08 12:09:38.0 [mpmorahan] insert AltLabel (id: null text: ALOS Science Project language code: en);
change note: 2014-01-08 11:55:05.0 [mpmorahan] Insert Concept add broader relation (ALOS Science Project [f0b1c9c2-06b1-46c3-8b49-2ff046ed7496,106093] - A - C [0c89f3f4-7ab1-43ce-89ee-795d35f0e30a,77505]);
in scheme: projects
definition: Advanced Land Observing Satellite (ALOS) Science Project
type: Concept