DE/SENCKENBERG
in scheme: providers
definition: Under the roof of the Senckenberg Gesellschaft für Naturforschung (SGN), six research institutes and three natural history museums in Germany conduct research in bio- and geosciences and display science and scientific findings. [Summary provided by Senckenberg Research Institute]
type: Concept

GERMANY
type: Concept