DOI
type: Concept

DOI/USFWS/GIS
in scheme: providers
definition: Geospatial data and services are critical elements needed to meet the mission of the U.S. Fish and Wildlife Service (USFWS). Geographic Information Systems (GIS), Global Positioning Systems (GPS), and remote sensing are the primary elements which fall under the geospatial data and services umbrella. Geospatial services provide the technology to create, analyze, maintain, and distribute geospatial data and information. GIS, GPS and remote sensing play a vital role in all of the Service’s long-term goals and in analyzing and quantifying the USFWS Operational Plan Measures. Nationally coordinated support for geospatial services, along with regional support and infrastructure, promotes cost savings and enables improved business practices. GIS, GPS and remote sensing can enable improved visualization, analysis, interoperability, modeling, and decision support. The benefits include increased accuracy, increased productivity, and more efficient information management and application support. This site was created to enable the USFWS to be effective in managing geospatial data resources and technology to successfully deliver geospatial services in support of the Service’s mission. [Summary provided by the U.S. Fish and Wildlife Service.]
type: Concept