VARIABLE SUBSETTING
change note: 2020-05-21 11:35:37.0 [tstevens] Insert Concept add broader relation (VARIABLE SUBSETTING [f2295f39-e8c5-4032-8a05-618d95410b28,560233] - SUBSETTING/SUPERSETTING [cc9e67fc-eafa-43cc-879f-0cb56b25bc39,84341]);
in scheme: sciencekeywords
definition: The process of selecting features of an object based on the variable parameters of the data.
type: Concept

SUBSETTING/SUPERSETTING
type: Concept