AECT
in scheme: providers
definition: The Amboseli Trust for Elephants aims to ensure the long-term conservation and welfare of Africa's elephants in the context of human needs and pressures through scientific research, training, community outreach, public awareness and advocacy. Summary Provided By: http://www.elephanttrust.org/node/268
type: Concept

CONSORTIA/INSTITUTIONS
type: Concept