M - O
type: Concept

NRMI
in scheme: projects
definition: The Natural Resources Management Index (NRMI) is a composite index for 226 countries derived from the average of four proximity-to-target scores from eco-region protection, access to improved sanitation, access to improved water and child mortality indicators. http://sedac.ciesin.columbia.edu/es/mcc.html [Summary provided by SEDAC.]
type: Concept