MARYLAND
type: Concept

MD/BC/DEPRM
in scheme: providers
definition: The mission of the Baltimore County Department of Environmental Protection and Resource Management (DEPRM) is to manage, protect, and enhance the natural resources of Baltimore County and the health of its citizens through the application of environmental and public health laws, principles, and practices. [Summary provided by Baltimore County DEPRM)
type: Concept