DATA VISUALIZATION
change note: 2020-05-21 11:26:16.0 [tstevens] Insert Concept add broader relation (DATA VISUALIZATION [f4c2557c-e958-4ea4-b7fb-249469f2c0db,560197] - DATA ANALYSIS AND VISUALIZATION [41adc080-c182-4753-9666-435f8b1c913f,84503]);
in scheme: sciencekeywords
definition: Refers to the graphic representation of data. It involves producing images that communicate relationships among the represented data to viewers of the images. This communication is achieved through the use of a systematic mapping between graphic marks and data values in the creation of the visualization. This mapping establishes how data values will be represented visually, determining how and to what extent a property of a graphic mark, such as size or color, will change to reflect changes in the value of a datum.
type: Concept

DATA ANALYSIS AND VISUALIZATION
type: Concept