ULG/AGO/COU
in scheme: providers
definition: The Chemical Oceanography Unit of the University of Liège aims to fill two crucial gaps in the present knowledge of global CO2 fluxes: the ignored Coastal Ocean and the remote Southern Ocean thought as the "last oceanic sink". In parallel, the Chemical Oceanography Unit also investigates the potential feed-backs between the oceanic biota and climate and their impact on global CO2 cycling.
type: Concept

ACADEMIC
type: Concept