Chemical Meters/Analyzers
type: Concept

Hawkeye 2DS
change note: 2020-07-21 08:14:34.0 [tstevens] insert AltLabel (id: null category: primary text: Hawkeye 2D-S Stereo Probe language code: en); insert Definition (id: null text: The Hawkeye probe was initially developed by SPEC to fly on the NASA Global Hawk Unmanned Aerial Vehicle (UAV). The Hawkeye is an outgrowth of the 3V-CPI, including all of the features of the 3V-CPI, with the addition of an FCDP (Fast Cloud Droplet Probe) in the front part of the sample tube, and the conversion of one 10-micron channel to a 50-micron channel in the 2D-S portion of the probe. In this way, the Hawkeye is actually a combination of four probes in one. language code: en);
change note: 2020-07-21 08:13:24.0 [tstevens] Insert Concept add broader relation (Hawkeye 2DS [f6fb2b75-e58c-4073-bcfb-9bee0b5e48ec,560548] - Chemical Meters/Analyzers [3d25724b-832f-4a61-b0b2-4f2ccecdba94,543779]);
in scheme: instruments
definition: The Hawkeye probe was initially developed by SPEC to fly on the NASA Global Hawk Unmanned Aerial Vehicle (UAV). The Hawkeye is an outgrowth of the 3V-CPI, including all of the features of the 3V-CPI, with the addition of an FCDP (Fast Cloud Droplet Probe) in the front part of the sample tube, and the conversion of one 10-micron channel to a 50-micron channel in the 2D-S portion of the probe. In this way, the Hawkeye is actually a combination of four probes in one.
type: Concept