Thermo Scientific NO-NO2-NOx Analyzer
change note: 2021-05-11 09:12:20.0 [tstevens] insert AltLabel (id: null category: primary text: Thermo Scientific Model 42i NO-NO2-NOx Analyzer language code: en); insert Definition (id: null text: Measure levels of nitrogen oxide (NO-NO2-NOx) in the emissions from a source using chemiluminescent technology with the Thermo Scientific™ Model 42i NO-NO2-NOx Analyzer. language code: en);
change note: 2021-05-11 09:10:23.0 [tstevens] Insert Concept add broader relation (Thermo Scientific NO-NO2-NOx Analyzer [f746495b-4fe2-4d63-b77a-b4ea5cc7f3e1,606922] - Chemical Meters/Analyzers [3d25724b-832f-4a61-b0b2-4f2ccecdba94,598603]);
in scheme: instruments
definition: Measure levels of nitrogen oxide (NO-NO2-NOx) in the emissions from a source using chemiluminescent technology with the Thermo Scientific™ Model 42i NO-NO2-NOx Analyzer.
type: Concept

Chemical Meters/Analyzers
type: Concept