GOES-1
change note: 2017-09-01 12:51:22.0 [sritz] update Definition (GOES-1 (SMS-C) was launched in October 1975 and was a NASA-developed, NOAA-operated, geosynchronous, and operational spacecraft. The cylindrically shaped spacecraft measured 190.5 cm in diameter and 230 cm in length, exclusive of a magnetometer that extended an additional 83 cm beyond the cylinder shell. The primary structural members were a honeycombed equipment shelf and thrust tube. The VISSR telescope was mounted on the equipment shelf and viewed the Earth through a special aperture in the side of the spacecraft. A support structure extended radially from the thrust tube and was affixed to the solar panels, which formed the outer walls of the spacecraft and provided the primary source of electrical power. Located in the annulus-shaped space between the thrust tube and the solar panels were stationkeeping and dynamics control equipment, batteries, and most of the SEM equipment. Proper spacecraft attitude and spin rate (approximately 100 rpm) were maintained by two separate sets of jet thrusters mounted around the spacecraft equator and activated by ground command. The spacecraft used both UHF-band and S-band frequencies in its telemetry and command subsystem. A low-power VHF transponder provided telemetry and command during launch and then served as a backup for the primary subsystem once the spacecraft attained orbit. This spin-stabilized spacecraft carried a visible infrared spin-scan radiometer, meteorological data collection and relay system, space environment monitor, and a biaxial fluxgate magnetometer. On December 1, 1978, responsibility for GOES 1 was turned over to ESA to be used as part of FGGE/GARP. It was stationed over the Indian Ocean and controlled by ESOC in Darmstadt, F.R.G. In December 1979, it was returned to the control of NOAA and positioned at 135 degrees West. When GOES 5 VAS experienced a failure on July 30, 1984, GOES 6 was moved east and GOES 1 was reactivated by NOAA to provide visible im…
change note: 2017-09-01 12:49:46.0 [sritz] insert Definition (id: null text: Source: NASA NSSDC, https://nssdc.gsfc.nasa.gov/ ] GOES-1 (SMS-C) was launched in October 1975 and was a NASA-developed, NOAA-operated, geosynchronous, and operational spacecraft. The cylindrically shaped spacecraft measured 190.5 cm in diameter and 230 cm in length, exclusive of a magnetometer that extended an additional 83 cm beyond the cylinder shell. The primary structural members were a honeycombed equipment shelf and thrust tube. The VISSR telescope was mounted on the equipment shelf and viewed the Earth through a special aperture in the side of the spacecraft. A support structure extended radially from the thrust tube and was affixed to the solar panels, which formed the outer walls of the spacecraft and provided the primary source of electrical power. Located in the annulus-shaped space between the thrust tube and the solar panels were stationkeeping and dynamics control equipment, batteries, and most of the SEM equipment. Proper spacecraft attitude and spin rate (approximately 100 rpm) were maintained by two separate sets of jet thrusters mounted around the spacecraft equator and activated by ground command. The spacecraft used both UHF-band and S-band frequencies in its telemetry and command subsystem. A low-power VHF transponder provided telemetry and command during launch and then served as a backup for the primary subsystem once the spacecraft attained orbit. This spin-stabilized spacecraft carried a visible infrared spin-scan radiometer, meteorological data collection and relay system, space environment monitor, and a biaxial fluxgate magnetometer. On December 1, 1978, responsibility for GOES 1 was turned over to ESA to be used as part of FGGE/GARP. It was stationed over the Indian Ocean and controlled by ESOC in Darmstadt, F.R.G. In December 1979, it was returned to the control of NOAA and positioned at 135 degrees West. When GOES 5 VAS experienced a failure on July 30, 1984, GOES 6 was m…
change note: 2017-09-01 12:36:06.0 [sritz] Insert Concept add broader relation (GOES-1 [f86fcbce-178c-410a-8e6e-380c0bc392ad,310075] - GOES [6e332c25-caeb-4917-afb6-af757bcecd72,310071]);
in scheme: platforms
definition: GOES-1 (SMS-C) was launched in October 1975 and was a NASA-developed, NOAA-operated, geosynchronous, and operational spacecraft. The cylindrically shaped spacecraft measured 190.5 cm in diameter and 230 cm in length, exclusive of a magnetometer that extended an additional 83 cm beyond the cylinder shell. The primary structural members were a honeycombed equipment shelf and thrust tube. The VISSR telescope was mounted on the equipment shelf and viewed the Earth through a special aperture in the side of the spacecraft. A support structure extended radially from the thrust tube and was affixed to the solar panels, which formed the outer walls of the spacecraft and provided the primary source of electrical power. Located in the annulus-shaped space between the thrust tube and the solar panels were stationkeeping and dynamics control equipment, batteries, and most of the SEM equipment. Proper spacecraft attitude and spin rate (approximately 100 rpm) were maintained by two separate sets of jet thrusters mounted around the spacecraft equator and activated by ground command. The spacecraft used both UHF-band and S-band frequencies in its telemetry and command subsystem. A low-power VHF transponder provided telemetry and command during launch and then served as a backup for the primary subsystem once the spacecraft attained orbit. This spin-stabilized spacecraft carried a visible infrared spin-scan radiometer, meteorological data collection and relay system, space environment monitor, and a biaxial fluxgate magnetometer. On December 1, 1978, responsibility for GOES 1 was turned over to ESA to be used as part of FGGE/GARP. It was stationed over the Indian Ocean and controlled by ESOC in Darmstadt, F.R.G. In December 1979, it was returned to the control of NOAA and positioned at 135 degrees West. When GOES 5 VAS experienced a failure on July 30, 1984, GOES 6 was moved east and GOES 1 was reactivated by NOAA to provide visible imaging capability over the western U.S. GOES 1 fai…
type: Concept

Geostationary Operational Environmental Satellite (GOES)
type: Concept