GODAE
in scheme: projects
definition: GODAE is an initiative to make ocean monitoring and prediction a routine activity akin to weather forecasting. GODAE envisages a global system of observations, communications, modelling and assimilation that will deliver regular, comprehensive information on the state of the oceans. This information will have wide utility for the benefit of the community. US GODAE Monterey Server: "http://www.usgodae.org/" MERSEA (European GODAE Portal): "http://strand1.mersea.eu.org/html/strand1/datalinks.html#insitu"
type: Concept

G - I
type: Concept