HAQAST
definition: HAQAST is part of a decade-long effort by NASA’s Applied Science Program to re-envision how applied science teams work. The effort began with the Air Quality Applied Science Team (AQAST), which ran from 2011 – 2016. Recognizing that health was an integral component of applied air quality research, NASA formed the first HAQAST team, which ran from 2016 – 2020. Due to the success of both AQAST and HAQAST, NASA expanded the newest version of HAQAST (2021 – 2025) to fourteen members composed of air quality and public health scientists led by Dr. Tracey Holloway at the University of Wisconsin-Madison. Though HAQAST is headquartered at UW-Madison, its members are spread across the U.S., in government offices and public and private universities. [Source: https://haqast.org/nasa-applied-science-team/]
in scheme: projects
type: Concept
change note: 2023-01-26 15:17:19.0 [sritz] insert Definition (id: null text: HAQAST is part of a decade-long effort by NASA’s Applied Science Program to re-envision how applied science teams work. The effort began with the Air Quality Applied Science Team (AQAST), which ran from 2011 – 2016. Recognizing that health was an integral component of applied air quality research, NASA formed the first HAQAST team, which ran from 2016 – 2020. Due to the success of both AQAST and HAQAST, NASA expanded the newest version of HAQAST (2021 – 2025) to fourteen members composed of air quality and public health scientists led by Dr. Tracey Holloway at the University of Wisconsin-Madison. Though HAQAST is headquartered at UW-Madison, its members are spread across the U.S., in government offices and public and private universities. [Source: https://haqast.org/nasa-applied-science-team/] language code: en);
change note: 2023-01-26 15:13:33.0 [sritz] Insert Concept add broader relation (HAQAST [f8cc8a2b-8f60-46d4-8084-98934375990a,1202693] - G - I [af0968ce-ffe3-44a0-86de-2ec9b9a8fa5d,1196714]);
change note: 2023-01-26 15:19:02.0 [sritz] update AltLabel (Health and Air Quality Applied Sciences Team);
change note: 2023-01-26 15:15:52.0 [sritz] insert AltLabel (id: null category: primary text: Health and Air Quality Applied Science Team language code: en);

G - I
type: Concept