GEOLOGIC/TECTONIC/PALEOCLIMATE MODELS
in scheme: sciencekeywords
definition: Models that represent or predict the geology over a given area; the tectonic activity or probability of earthquakes and tectonic movement, or prevention of future earthquakes; and paleoclimate reconstructions or predictions of future climate systems.
type: Concept

MODELS
type: Concept