Photon/Optical Detectors
type: Concept

Microtomography
change note: 2023-05-11 14:30:16.0 [tstevens] insert Definition (id: null text: Microtomography uses X-rays to image cross-sections of a physical object without destroying the original object. The images can be used to create a 3D model of the object. language code: en);
change note: 2023-05-11 14:28:10.0 [tstevens] Insert Concept add broader relation (Microtomography [f9b2f95d-3edf-47f8-87a2-0fdf67b974e5,1306136] - Photon/Optical Detectors [8143e95e-a438-4a2a-82b2-6d7ae079fba7,1297757]);
in scheme: instruments
definition: Microtomography uses X-rays to image cross-sections of a physical object without destroying the original object. The images can be used to create a 3D model of the object.
type: Concept