M - O
type: Concept

NVAP-M
type: Concept
change note: 2020-12-17 08:43:49.0 [tstevens] update AltLabel (NASA Water Vapor Project (NVAP) - Making Earth Science Data Records for Use in Research Environments (MEaSUREs));
change note: 2016-03-16 16:04:12.0 [saritz] update Definition (The NASA MEaSUREs program began in 2008 and has the goal of creating stable, community accepted Earth System Data Records (ESDRs) for a variety of geophysical time series. A reanalysis and extension of the NASA Water Vapor Project (NVAP (link is external)), called NVAP-M was performed by Science and Technology Corporation, METSAT Division as part of this program. NVAP-M spans 1988-2009. NVAP-M is further described in Vonder Haar, T. H., J. L. Bytheway and J. M. Forsythe, 2012: "Weather and climate analyses using improved global water vapor observations." Geophys. Res. Lett., 39, L16802, doi:10.1029/2012GL052094 (link is external) The heritage NASA Water Vapor Project (NVAP) total column (integrated) water vapor data sets comprised a combination of radiosonde observations, Television and Infrared Operational Satellite (TIROS) Operational Vertical Sounders (TOVS), and Special Sensor Microwave/Imager (SSM/I) data sets. These data sets spanned 14 years (1988 - 2001) and contained total and layered global water vapor data. The spatial coverage was global for all data sets. NVAP-M completely supercedes the heritage NVAP data set.);
change note: 2016-03-16 13:56:45.0 [saritz] S. Ritz revised project at request of ASDC DAAC. insert Definition (id: null text: he NASA MEaSUREs program began in 2008 and has the goal of creating stable, community accepted Earth System Data Records (ESDRs) for a variety of geophysical time series. A reanalysis and extension of the NASA Water Vapor Project (NVAP (link is external)), called NVAP-M was performed by Science and Technology Corporation, METSAT Division as part of this program. NVAP-M spans 1988-2009. NVAP-M is further described in Vonder Haar, T. H., J. L. Bytheway and J. M. Forsythe, 2012: "Weather and climate analyses using improved global water vapor observations." Geophys. Res. Lett., 39, L16802, doi:10.1029/2012GL052094 (link is external) The heritage NASA Water Vapor Project (NVAP) total column (integrated) water vapor data sets comprised a combination of radiosonde observations, Television and Infrared Operational Satellite (TIROS) Operational Vertical Sounders (TOVS), and Special Sensor Microwave/Imager (SSM/I) data sets. These data sets spanned 14 years (1988 - 2001) and contained total and layered global water vapor data. The spatial coverage was global for all data sets. NVAP-M completely supercedes the heritage NVAP data set. language code: en);
change note: 2016-03-16 13:54:39.0 [saritz] Insert Concept add broader relation (NVAP-M [fa457a23-47ed-4caa-b992-5b9f8cd229c8,158699] - M - O [a31c2828-9b6d-44e9-b6ad-7ae81030f322,149461]);
change note: 2020-08-12 09:42:04.0 [tstevens] insert AltLabel (id: null category: primary text: NASA Water Vapor Project (NVAP) - Making Earth Science Data Records for Use in Research Environments (MEaSUREs) language code: en); update Definition (The NASA MEaSUREs program began in 2008 and has the goal of creating stable, community accepted Earth System Data Records (ESDRs) for a variety of geophysical time series. A reanalysis and extension of the NASA Water Vapor Project (NVAP), called NVAP-M was performed by Science and Technology Corporation, METSAT Division as part of this program. NVAP-M spans 1988-2009. NVAP-M is further described in Vonder Haar, T. H., J. L. Bytheway and J. M. Forsythe, 2012: "Weather and climate analyses using improved global water vapor observations." Geophys. Res. Lett., 39, L16802, doi:10.1029/2012GL052094 The heritage NASA Water Vapor Project (NVAP) total column (integrated) water vapor data sets comprised a combination of radiosonde observations, Television and Infrared Operational Satellite (TIROS) Operational Vertical Sounders (TOVS), and Special Sensor Microwave/Imager (SSM/I) data sets. These data sets spanned 14 years (1988 - 2001) and contained total and layered global water vapor data. The spatial coverage was global for all data sets. NVAP-M completely supercedes the heritage NVAP data set.); update Definition (https://asdc.larc.nasa.gov/project/NVAP-M);
in scheme: projects
definition: The NASA MEaSUREs program began in 2008 and has the goal of creating stable, community accepted Earth System Data Records (ESDRs) for a variety of geophysical time series. A reanalysis and extension of the NASA Water Vapor Project (NVAP), called NVAP-M was performed by Science and Technology Corporation, METSAT Division as part of this program. NVAP-M spans 1988-2009. NVAP-M is further described in Vonder Haar, T. H., J. L. Bytheway and J. M. Forsythe, 2012: "Weather and climate analyses using improved global water vapor observations." Geophys. Res. Lett., 39, L16802, doi:10.1029/2012GL052094 The heritage NASA Water Vapor Project (NVAP) total column (integrated) water vapor data sets comprised a combination of radiosonde observations, Television and Infrared Operational Satellite (TIROS) Operational Vertical Sounders (TOVS), and Special Sensor Microwave/Imager (SSM/I) data sets. These data sets spanned 14 years (1988 - 2001) and contained total and layered global water vapor data. The spatial coverage was global for all data sets. NVAP-M completely supercedes the heritage NVAP data set.