SOLAR ACTIVITY
type: Concept

SOLAR FLARES
in scheme: sciencekeywords
definition: A sudden and violent release of matter and energy within a solar activity region in the form of electromagnetic radiation, energetic particles, shock waves, lasting a few minutes to hours. Solar flares accelerate charged particles into interplanetary space.
type: Concept