SALT MARSH
change note: 2016-06-13 13:45:47.0 [gee-cee] insert Definition (id: null text: Pertaining to tidal wetlands areas dominated by salt-tolerant grasses. language code: en);
change note: 2016-06-13 13:45:19.0 [gee-cee] Insert Concept add broader relation (SALT MARSH [fbe91a4f-4d27-4cfe-ba1b-69a62e359a3d,188219] - COASTAL HABITAT [47be68db-d10d-43e7-b150-61cfd3f06126,84259]);
in scheme: sciencekeywords
definition: Pertaining to tidal wetlands areas dominated by salt-tolerant grasses.
type: Concept

COASTAL
type: Concept