Imaging Spectrometers/Radiometers
type: Concept

IMAGING RADIOMETERS
change note: 2021-08-05 12:20:29.0 [sritz] insert AltLabel (id: null category: primary text: IMAGING RADIOMETERS language code: en);
in scheme: instruments
definition: IMAGING RADIOMETERS are meters used to detect and measure radiant energy that can be either electromagnetic or acoustic and put that information in the form of images or visual pictures.
type: Concept