CORNELL/INSTOC
in scheme: providers
definition: The Institute for the Study of the Continents stimulates and facilitate research on the structure and evolution of the Earth's continents through various research projects. Website: http://www.geo.cornell.edu/instoc/INSTOChome.htm Information: INSTOC
type: Concept

ACADEMIC
type: Concept