G - I
type: Concept

ISLSCP II
alternative label: ISLSCP INITIATIVE-II
change note: 2017-05-23 17:37:31.0 [sritz] insert Definition (id: null text: The International Satellite Land Surface Climatology Project, Initiative II (ISLSCP II) Project was part of the Global Energy and Water Experiment (GEWEX) and was responsible for addressing land-atmosphere interactions, process modeling, data retrieval algorithms, field experiment design and execution, and the development of global data sets. The ISLSCP II data set collection contains about 50 comprehensive data sets over the 10 year period from 1986 through 1995 focused on land cover, hydrometeorology, radiation, and soils. language code: en);
change note: 2017-06-14 12:22:54.0 [sritz] insert AltLabel (id: null text: ISLSCP INITIATIVE-I language code: en);
change note: 2017-05-23 17:36:33.0 [sritz] insert AltLabel (id: null text: International Satellite Land Surface Climatology Project Initiative-II language code: en);
change note: 2017-05-23 17:35:49.0 [sritz] Insert Concept add broader relation (ISLSCP INITIATIVE-II [fda2b847-b3d1-4449-a26a-d948df554607,309595] - G - I [af0968ce-ffe3-44a0-86de-2ec9b9a8fa5d,294133]);
change note: 2017-06-14 12:21:37.0 [sritz] update AltLabel (International Satellite Land Surface Climatology Project II); update PrefLabel (ISLSCP II); update Definition (The International Satellite Land Surface Climatology Project, Initiative II (ISLSCP II) was part of the Global Energy and Water Experiment (GEWEX) and was responsible for addressing land-atmosphere interactions, process modeling, data retrieval algorithms, field experiment design and execution, and the development of global data sets. The ISLSCP II data set collection contains about 50 comprehensive data sets over the 10 year period from 1986 through 1995 focused on land cover, hydrometeorology, radiation, and soils.); update Definition ();
type: Concept
definition: The International Satellite Land Surface Climatology Project, Initiative II (ISLSCP II) was part of the Global Energy and Water Experiment (GEWEX) and was responsible for addressing land-atmosphere interactions, process modeling, data retrieval algorithms, field experiment design and execution, and the development of global data sets. The ISLSCP II data set collection contains about 50 comprehensive data sets over the 10 year period from 1986 through 1995 focused on land cover, hydrometeorology, radiation, and soils.
in scheme: projects