UNITED KINGDOM
type: Concept

UK/DARDNI
change note: 2014-04-30 09:10:54.0 [128.183.164.42] update PrefLabel (UK/DARDNI);
in scheme: providers
definition: The responsibilities of the Department of Agriculture and Rural Development include: -the development of the agricultural, forestry and fishing industries in Northern Ireland; -rural development in Northern Ireland; -providing an advisory service for farmers; -agricultural research and education; -providing a veterinary service and administration of animal health and welfare policies; -responsibility to the Ministry of Agriculture, Fisheries and Food in the administration in Northern Ireland of schemes affecting the whole of the United Kingdom; -the application of EU agricultural policy to Northern Ireland. Website: "http://www.dardni.gov.uk/" [Summary provided by Department of Agriculture and Rural Development for Northern Ireland.]
type: Concept