HEATING DEGREE DAYS
change note: 2012-07-09 14:53:41.0 [mpmorahan] insert Definition (id: null text: Degree days are based on the assumption that when the outside temperature is 65°F, we don't need heating or cooling to be comfortable. Degree days are the difference between the daily temperature mean, (high temperature plus low temperature divided by two) and 65°F. If the temperature mean is above 65°F, we subtract 65 from the mean and the result is Cooling Degree Days. If the temperature mean is below 65°F, we subtract the mean from 65 and the result is Heating Degree Days. -------------------------------------------------------------------------- Example 1: The high temperature for a particular day was 90°F and the low temperature was 66°F. The temperature mean for that day was: ( 90°F + 66°F ) / 2 = 78°F Because the result is above 65°F: 78°F - 65°F = 13 Cooling Degree Days Example 2: The high temperature for a particular day was 33°F and the low temperature was 25°F. The temperature mean for that day was: ( 33°F + 25°F ) / 2 = 29°F Because the result is below 65°F: 65°F - 29°F = 36 Heating Degree Days. The calculations shown in the two examples above are performed for each day of the year and the daily degree days are accumulated so that we can compare months and seasons. language code: en);
change note: 2012-06-26 10:21:07.0 [gee-cee] Insert Concept add broader relation (HEATING DEGREE DAYS [fe2bc223-e503-4ca1-924c-d3fd5876721c,39799] - TEMPERATURE INDICES [e8580cbb-701a-4ab1-a40f-5fae4ae1ea24,39791]);
in scheme: sciencekeywords
definition: Degree days are based on the assumption that when the outside temperature is 65°F, we don't need heating or cooling to be comfortable. Degree days are the difference between the daily temperature mean, (high temperature plus low temperature divided by two) and 65°F. If the temperature mean is above 65°F, we subtract 65 from the mean and the result is Cooling Degree Days. If the temperature mean is below 65°F, we subtract the mean from 65 and the result is Heating Degree Days. -------------------------------------------------------------------------- Example 1: The high temperature for a particular day was 90°F and the low temperature was 66°F. The temperature mean for that day was: ( 90°F + 66°F ) / 2 = 78°F Because the result is above 65°F: 78°F - 65°F = 13 Cooling Degree Days Example 2: The high temperature for a particular day was 33°F and the low temperature was 25°F. The temperature mean for that day was: ( 33°F + 25°F ) / 2 = 29°F Because the result is below 65°F: 65°F - 29°F = 36 Heating Degree Days. The calculations shown in the two examples above are performed for each day of the year and the daily degree days are accumulated so that we can compare months and seasons.
type: Concept

TEMPERATURE INDICES
type: Concept