CONVECTIVE CLOUDS/SYSTEMS (OBSERVED/ANALYZED)
type: Concept

TROPICAL OCEANIC CLOUD SYSTEMS
change note: 2013-03-20 17:32:59.0 [mpmorahan] insert Definition (id: null text: Tropical oceanic cloud systems, which are recognized as an essential component of the global climate system, are complex phenomena in geophysical flows due to the vast range of scales of motion involved and the nonlinearity of interactions among the attendant physical processes (e.g., phase changes of water, cloud-interactive radiation, turbulence and surface fluxes) . Cloud systems directly couple dynamical and hydrological processes in the atmosphere through the release of latent heat of condensation and evaporation, through precipitation, and through the vertical redistribution of sensible heat, moisture and momentum. They have an equally important effects on the large-scale radiation budget, through the reflection, absorption and emission of radiation, and the surface energy budget, through the modification of net radiative fluxes and net heat fluxes at the ocean surface. language code: en);
change note: 2013-02-14 09:24:01.0 [mpmorahan] Insert Concept add broader relation (TROPICAL OCEANIC CLOUD SYSTEMS [fe2e0b6f-3d7d-489a-b093-86ed0d233385,82201] - CONVECTIVE CLOUDS/SYSTEMS (OBSERVED/ANALYZED) [9a802ef3-680d-4bc6-a42e-aa84d5eb9908,82127]);
in scheme: sciencekeywords
definition: Tropical oceanic cloud systems, which are recognized as an essential component of the global climate system, are complex phenomena in geophysical flows due to the vast range of scales of motion involved and the nonlinearity of interactions among the attendant physical processes (e.g., phase changes of water, cloud-interactive radiation, turbulence and surface fluxes) . Cloud systems directly couple dynamical and hydrological processes in the atmosphere through the release of latent heat of condensation and evaporation, through precipitation, and through the vertical redistribution of sensible heat, moisture and momentum. They have an equally important effects on the large-scale radiation budget, through the reflection, absorption and emission of radiation, and the surface energy budget, through the modification of net radiative fluxes and net heat fluxes at the ocean surface.
type: Concept