DOC/NOAA/NWS/APRFC
in scheme: providers
definition: The National Weather Service (NWS) provides weather, hydrologic, and climate forecasts and warnings for the United States, its territories, adjacent waters and ocean areas, for the protection of life and property and the enhancement of the national economy. NWS data and products form a national information database and infrastructure which can be used by other governmental agencies, the private sector, the public, and the global community. In support of this NWS mission, the Alaska-Pacific River Forecast Center (APRFC) produces timely and accurate water forecasts and information using the best available scientific principles to integrate and model water, weather, and climate information. Our highly-motivated, customer-focused staff is dedicated to professionalism, innovation, and fulfilling expectations of our customers and partners. Summary provided by http://aprfc.arh.noaa.gov/resources/docs/apmission.html
type: Concept

NOAA
type: Concept