PRECIPITATION AMOUNT
type: Concept

12 HOUR PRECIPITATION AMOUNT
change note: 2014-04-15 09:48:29.0 [128.183.164.42] added definition insert Definition (id: null text: The amount of precipitation collected and measured at a weather observing site during a 12 hour period. language code: en);
change note: 2014-04-14 14:26:08.0 [128.183.164.42] Insert Concept add broader relation (12 HOUR PRECIPITATION AMOUNT [feef8827-92a6-4d1d-b6a5-ecda38a32656,106317] - PRECIPITATION AMOUNT [cad5c02a-e771-434e-bef6-8dced38a68e8,84205]);
in scheme: sciencekeywords
definition: The amount of precipitation collected and measured at a weather observing site during a 12 hour period.
type: Concept