Probes
type: Concept

ELECTRON MICROPROBES
in scheme: instruments
definition: An electron microprobe is an electron microscope designed for the non-destructive x-ray microanalysis and imaging of solid materials. It is capable of high spatial resolution and relatively high analytical sensitivity. [Source: Caltech]
type: Concept