M - O
type: Concept

NGEE-Arctic
change note: 2015-12-01 15:28:42.0 [gee-cee] insert AltLabel (id: null text: Next-Generation Ecosystem Experiments Arctic language code: en);
change note: 2015-12-01 15:27:53.0 [gee-cee] Insert Concept add broader relation (NGEE-Arctic [ffcca1c5-fffd-4359-b282-e00fc77c979e,158523] - M - O [a31c2828-9b6d-44e9-b6ad-7ae81030f322,149461]);
in scheme: projects
definition: The Next-Generation Ecosystem Experiments (NGEE Arctic) seeks to address this challenge by quantifying the physical, chemical, and biological behavior of terrestrial ecosystems in Alaska. Initial research will focus on the highly dynamic landscapes of the North Slope (Barrow, Alaska) where thaw lakes, drained thaw lake basins, and ice-rich polygonal ground offer distinct land units for investigation and modeling. A focus on scaling based on investigations within these geomorphological units will allow us to deliver a process-rich ecosystem model, extending from bedrock to the top of the vegetative canopy, in which the evolution of Arctic ecosystems in a changing climate can be modeled at the scale of a high resolution Earth System Model grid cell (i.e., 30x30 km grid size). This vision includes mechanistic studies in the field and in the laboratory; modeling of critical and interrelated water, nitrogen, carbon, and energy dynamics; and characterization of important interactions from molecular to landscape scales that drive feedback to the climate system.
type: Concept